Uploaded image for project: 'Alfresco One Platform'
  1. Alfresco One Platform
  2. ACE-1791

Release 36 Enterprise Regression Testing (WAT1 Release)

    Details

    • Type: Task
    • Status: Closed (View Workflow)
    • Priority: Blocker
    • Resolution: Fixed
    • Affects Version/s: Cloud 36
    • Fix Version/s: 5.0
    • Component/s: Share Application
    • Labels:
      None

      Description

      Release 36 DP Regression test plan

      1. Upgrade: schema changes tests to confirm if we have schema changes or not. Depending on the result we would either execute rolling upgrade or stop start upgrade in DP.
      a. Test plan name: Cloud-Upgrades
      2. Manual Tests (Faceted search enabled)
      a. Test plan name: Cloud2-DP-Regression (includes resilience tests as well)
      3. Automation Tests (Faceted search enabled)
      a. Test Plan Name: Cloud2-DP-Regression (cloud and comalfone project)
      4. Benchmark Tests
      a. BM0015
      b. BM0012
      5. Defect testing, if any.
      6. Additional tests for this release
      a. Custom extension module for disabling faceted search. If this extension module applied then faceted search should only be available for alfresco.com and if not applied then it should be available for all networks. We just need to test that.
      b. security.anyDenyDenies property changes tests. if set to false then faceted search should work, if set to true then faceted search won't work. We just need to test that.
      c. Live Search now available for all networks. We need to do execute live search specific tests for any other network to confirm this.
      d. Facted search tests should be available for all networks now, however some features are limited to alfresco.com network only. I don't have the list now but i will let you know shortly.

        Attachments

          Issue Links

          1.
          Search is not performed by site name Feature Bug Closed Closed Issues  
          2.
          "Recently modified" filter for site document library doesn't work for Alfresco Enterprise version. Feature Bug Closed Closed Issues  
          3.
          Solr: Search not working on some dashlets Feature Bug Closed Closed Issues  
          4.
          "Could not retrieve tags error" was detected for Reprository. Feature Bug Closed Closed Issues  
          5.
          Cannot find system files on the Search page in Share Feature Bug Closed Closed Issues  
          6.
          BM-0010, BM-0013 tests didn't completely run for 4.3.0 b1717. Feature Bug Closed Closed Issues  
          7.
          Failed to validate model update Feature Bug Closed Closed Issues  
          8.
          Performance degradation was detected during to BM-0012 test for Alfresco 4.3.0 (build 1717) Feature Bug Closed Closed Issues  
          9.
          Cannot select transfer target by creating job Feature Bug Closed Closed Issues

          100%

          Original Estimate - Not Specified Original Estimate - Not Specified
          Time Spent - 3 hours
          10.
          Site visiblity option is set as "public" by default Feature Bug Closed Closed Issues  
          11.
          "ProtocolException: Unbuffered entity enclosing request can not be repeated" error was detected during to BM-0002 jmeter test. Feature Bug Closed Closed Issues

          100%

          Original Estimate - Not Specified Original Estimate - Not Specified
          Time Spent - 2 days, 5 hours
          12.
          "WebScriptException: 042819644 Failed to convert request to JSON" error was detected in the log during to BM-0002 test. Feature Bug Closed Closed Issues

          100%

          Original Estimate - Not Specified Original Estimate - Not Specified
          Time Spent - 2 days, 5 hours
          13.
          org.springframework.extensions.webscripts.WebScriptException: 043020030 Authentication failed for Web Script org/alfresco/slingshot/documentlibrary/doclist.get error was detected during to BM-0002 test for Alfresco 4.3.0 b1727. Feature Bug Closed Closed Issues  
          14.
          User with a non ASCII username logs in through 500 Internal server error Feature Bug Closed Closed Issues  
          15.
          Performance degradation was detected during to BM-0012 test for 4.3.0 b-1749. Feature Bug Closed Closed Issues  

            Structure

              Activity

                People

                • Assignee:
                  closedissues Closed Issues
                  Reporter:
                  rmanthena Ravi Manthena [X] (Inactive)
                • Votes:
                  0 Vote for this issue
                  Watchers:
                  2 Start watching this issue

                  Dates

                  • Created:
                    Updated:
                    Resolved:

                    Time Tracking

                    Estimated:
                    Original Estimate - Not Specified
                    Not Specified
                    Remaining:
                    Remaining Estimate - 0 minutes
                    0m
                    Logged:
                    Time Spent - 1 week, 5 hours
                    1w 5h

                      Structure Helper Panel