Details

      Description

      A lot of failures were detected during to bm-0010 jmeter test after reindex was finished.

      Next errors were detected in the logs on at1-at4:

      2014-05-26 11:36:38,642  ERROR [extensions.webscripts.AbstractRuntime] [catalina-share-4] Exception from executeScript - redirecting to status template error: 04260001 Failed to execute script 'classpath*:alfresco/site-webscripts/org/alfresco/modules/header/sites.get.js': 04260000 ReferenceError: "result" is not defined. (file:/home/bm0013/alfresco-4.3.0-b1717/tomcat/webapps/share/WEB-INF/classes/alfresco/site-webscripts/org/alfresco/modules/header/sites.get.js#39)
       org.springframework.extensions.webscripts.WebScriptException: 04260001 Failed to execute script 'classpath*:alfresco/site-webscripts/org/alfresco/modules/header/sites.get.js': 04260000 ReferenceError: "result" is not defined. (file:/home/bm0013/alfresco-4.3.0-b1717/tomcat/webapps/share/WEB-INF/classes/alfresco/site-webscripts/org/alfresco/modules/header/sites.get.js#39)
      	at org.springframework.extensions.webscripts.processor.JSScriptProcessor.executeScript(JSScriptProcessor.java:200)
      	at org.springframework.extensions.webscripts.AbstractWebScript.executeScript(AbstractWebScript.java:1367)
      	at org.springframework.extensions.webscripts.DeclarativeWebScript.execute(DeclarativeWebScript.java:86)
      	at org.springframework.extensions.webscripts.PresentationContainer.executeScript(PresentationContainer.java:70)
      	at org.springframework.extensions.webscripts.LocalWebScriptRuntimeContainer.executeScript(LocalWebScriptRuntimeContainer.java:236)
      	at org.springframework.extensions.webscripts.AbstractRuntime.executeScript(AbstractRuntime.java:378)
      	at org.springframework.extensions.webscripts.AbstractRuntime.executeScript(AbstractRuntime.java:209)
      	at org.springframework.extensions.webscripts.servlet.mvc.WebScriptView.renderMergedOutputModel(WebScriptView.java:104)
      	at org.springframework.web.servlet.view.AbstractView.render(AbstractView.java:250)
      	at org.springframework.web.servlet.DispatcherServlet.render(DispatcherServlet.java:1047)
      	at org.springframework.web.servlet.DispatcherServlet.doDispatch(DispatcherServlet.java:817)
      	at org.springframework.web.servlet.DispatcherServlet.doService(DispatcherServlet.java:719)
      	at org.springframework.web.servlet.FrameworkServlet.processRequest(FrameworkServlet.java:644)
      	at org.springframework.web.servlet.FrameworkServlet.doGet(FrameworkServlet.java:549)
      	at javax.servlet.http.HttpServlet.service(HttpServlet.java:620)
      	at javax.servlet.http.HttpServlet.service(HttpServlet.java:727)
      	at org.apache.catalina.core.ApplicationFilterChain.internalDoFilter(ApplicationFilterChain.java:303)
      	at org.apache.catalina.core.ApplicationFilterChain.doFilter(ApplicationFilterChain.java:208)
      	at org.apache.tomcat.websocket.server.WsFilter.doFilter(WsFilter.java:52)
      	at org.apache.catalina.core.ApplicationFilterChain.internalDoFilter(ApplicationFilterChain.java:241)
      	at org.apache.catalina.core.ApplicationFilterChain.doFilter(ApplicationFilterChain.java:208)
      	at org.apache.catalina.core.ApplicationDispatcher.invoke(ApplicationDispatcher.java:748)
      	at org.apache.catalina.core.ApplicationDispatcher.processRequest(ApplicationDispatcher.java:486)
      	at org.apache.catalina.core.ApplicationDispatcher.doForward(ApplicationDispatcher.java:411)
      	at org.apache.catalina.core.ApplicationDispatcher.forward(ApplicationDispatcher.java:338)
      	at org.tuckey.web.filters.urlrewrite.NormalRewrittenUrl.doRewrite(NormalRewrittenUrl.java:213)
      	at org.tuckey.web.filters.urlrewrite.RuleChain.handleRewrite(RuleChain.java:171)
      	at org.tuckey.web.filters.urlrewrite.RuleChain.doRules(RuleChain.java:145)
      	at org.tuckey.web.filters.urlrewrite.UrlRewriter.processRequest(UrlRewriter.java:92)
      	at org.tuckey.web.filters.urlrewrite.UrlRewriteFilter.doFilter(UrlRewriteFilter.java:389)
      	at org.apache.catalina.core.ApplicationFilterChain.internalDoFilter(ApplicationFilterChain.java:241)
      	at org.apache.catalina.core.ApplicationFilterChain.doFilter(ApplicationFilterChain.java:208)
      	at org.alfresco.web.site.servlet.SecurityHeadersFilter.doFilter(SecurityHeadersFilter.java:168)
      	at org.apache.catalina.core.ApplicationFilterChain.internalDoFilter(ApplicationFilterChain.java:241)
      	at org.apache.catalina.core.ApplicationFilterChain.doFilter(ApplicationFilterChain.java:208)
      	at org.alfresco.web.site.servlet.CSRFFilter.doFilter(CSRFFilter.java:322)
      	at org.apache.catalina.core.ApplicationFilterChain.internalDoFilter(ApplicationFilterChain.java:241)
      	at org.apache.catalina.core.ApplicationFilterChain.doFilter(ApplicationFilterChain.java:208)
      	at org.apache.catalina.core.StandardWrapperValve.invoke(StandardWrapperValve.java:220)
      	at org.apache.catalina.core.StandardContextValve.invoke(StandardContextValve.java:122)
      	at org.apache.catalina.authenticator.AuthenticatorBase.invoke(AuthenticatorBase.java:501)
      	at org.apache.catalina.core.StandardHostValve.invoke(StandardHostValve.java:170)
      	at org.apache.catalina.valves.ErrorReportValve.invoke(ErrorReportValve.java:98)
      	at org.apache.catalina.core.StandardEngineValve.invoke(StandardEngineValve.java:116)
      	at org.apache.catalina.connector.CoyoteAdapter.service(CoyoteAdapter.java:408)
      	at org.apache.coyote.ajp.AjpAprProcessor.process(AjpAprProcessor.java:190)
      	at org.apache.coyote.AbstractProtocol$AbstractConnectionHandler.process(AbstractProtocol.java:607)
      	at org.apache.tomcat.util.net.AprEndpoint$SocketProcessor.doRun(AprEndpoint.java:2441)
      	at org.apache.tomcat.util.net.AprEndpoint$SocketProcessor.run(AprEndpoint.java:2430)
      	at java.util.concurrent.ThreadPoolExecutor.runWorker(ThreadPoolExecutor.java:1145)
      	at java.util.concurrent.ThreadPoolExecutor$Worker.run(ThreadPoolExecutor.java:615)
      	at java.lang.Thread.run(Thread.java:724)
      Caused by: org.springframework.extensions.webscripts.WebScriptException: 04260000 ReferenceError: "result" is not defined. (file:/home/bm0013/alfresco-4.3.0-b1717/tomcat/webapps/share/WEB-INF/classes/alfresco/site-webscripts/org/alfresco/modules/header/sites.get.js#39)
      	at org.springframework.extensions.webscripts.processor.JSScriptProcessor.executeScriptImpl(JSScriptProcessor.java:328)
      	at org.springframework.extensions.webscripts.processor.JSScriptProcessor.executeScript(JSScriptProcessor.java:192)
      	... 51 more
      Caused by: org.mozilla.javascript.EcmaError: ReferenceError: "result" is not defined. (file:/home/bm0013/alfresco-4.3.0-b1717/tomcat/webapps/share/WEB-INF/classes/alfresco/site-webscripts/org/alfresco/modules/header/sites.get.js#39)
      	at org.mozilla.javascript.ScriptRuntime.constructError(ScriptRuntime.java:3687)
      	at org.mozilla.javascript.ScriptRuntime.constructError(ScriptRuntime.java:3665)
      	at org.mozilla.javascript.ScriptRuntime.notFoundError(ScriptRuntime.java:3750)
      	at org.mozilla.javascript.ScriptRuntime.nameOrFunction(ScriptRuntime.java:1794)
      	at org.mozilla.javascript.ScriptRuntime.name(ScriptRuntime.java:1733)
      	at org.mozilla.javascript.gen.file__home_bm0013_alfresco_4_3_0_b1717_tomcat_webapps_share_WEB_INF_classes_alfresco_site_webscripts_org_alfresco_modules_header_sites_get_js_45._c_main_2(file:/home/bm0013/alfresco-4.3.0-b1717/tomcat/webapps/share/WEB-INF/classes/alfresco/site-webscripts/org/alfresco/modules/header/sites.get.js:39)
      	at org.mozilla.javascript.gen.file__home_bm0013_alfresco_4_3_0_b1717_tomcat_webapps_share_WEB_INF_classes_alfresco_site_webscripts_org_alfresco_modules_header_sites_get_js_45.call(file:/home/bm0013/alfresco-4.3.0-b1717/tomcat/webapps/share/WEB-INF/classes/alfresco/site-webscripts/org/alfresco/modules/header/sites.get.js)
      	at org.mozilla.javascript.optimizer.OptRuntime.callName0(OptRuntime.java:74)
      	at org.mozilla.javascript.gen.file__home_bm0013_alfresco_4_3_0_b1717_tomcat_webapps_share_WEB_INF_classes_alfresco_site_webscripts_org_alfresco_modules_header_sites_get_js_45._c_script_0(file:/home/bm0013/alfresco-4.3.0-b1717/tomcat/webapps/share/WEB-INF/classes/alfresco/site-webscripts/org/alfresco/modules/header/sites.get.js:128)
      	at org.mozilla.javascript.gen.file__home_bm0013_alfresco_4_3_0_b1717_tomcat_webapps_share_WEB_INF_classes_alfresco_site_webscripts_org_alfresco_modules_header_sites_get_js_45.call(file:/home/bm0013/alfresco-4.3.0-b1717/tomcat/webapps/share/WEB-INF/classes/alfresco/site-webscripts/org/alfresco/modules/header/sites.get.js)
      	at org.mozilla.javascript.ContextFactory.doTopCall(ContextFactory.java:394)
      	at org.mozilla.javascript.ScriptRuntime.doTopCall(ScriptRuntime.java:3091)
      	at org.mozilla.javascript.gen.file__home_bm0013_alfresco_4_3_0_b1717_tomcat_webapps_share_WEB_INF_classes_alfresco_site_webscripts_org_alfresco_modules_header_sites_get_js_45.call(file:/home/bm0013/alfresco-4.3.0-b1717/tomcat/webapps/share/WEB-INF/classes/alfresco/site-webscripts/org/alfresco/modules/header/sites.get.js)
      	at org.mozilla.javascript.gen.file__home_bm0013_alfresco_4_3_0_b1717_tomcat_webapps_share_WEB_INF_classes_alfresco_site_webscripts_org_alfresco_modules_header_sites_get_js_45.exec(file:/home/bm0013/alfresco-4.3.0-b1717/tomcat/webapps/share/WEB-INF/classes/alfresco/site-webscripts/org/alfresco/modules/header/sites.get.js)
      	at org.springframework.extensions.webscripts.processor.JSScriptProcessor.executeScriptImpl(JSScriptProcessor.java:318)
      	... 52 more
      
      2014-05-26 11:36:54,956  ERROR [extensions.webscripts.AbstractRuntime] [catalina-alfresco-22] Exception from executeScript - redirecting to status template error: 04260018 Wrapped Exception (with status template): 042641447 Failed to execute script 'classpath*:alfresco/templates/webscripts/org/alfresco/slingshot/documentlibrary/doclist.get.js': 042641446 Failed to execute search: +PATH:"/app:company_home/st:sites//cm:*" +@cm\:modified:[2014\-5\-19T00\:00\:00.000 TO 2014\-5\-26T23\:59\:59.999] +@cm\:modifier:"jmuser04000" +TYPE:"cm:content" -TYPE:"cm:systemfolder" -TYPE:"fm:forums" -TYPE:"fm:forum" -TYPE:"fm:topic" -TYPE:"fm:post" +(TYPE:"content" OR TYPE:"app:filelink" OR TYPE:"folder")
       org.springframework.extensions.webscripts.WebScriptException: 04260018 Wrapped Exception (with status template): 042641447 Failed to execute script 'classpath*:alfresco/templates/webscripts/org/alfresco/slingshot/documentlibrary/doclist.get.js': 042641446 Failed to execute search: +PATH:"/app:company_home/st:sites//cm:*" +@cm\:modified:[2014\-5\-19T00\:00\:00.000 TO 2014\-5\-26T23\:59\:59.999] +@cm\:modifier:"jmuser04000" +TYPE:"cm:content" -TYPE:"cm:systemfolder" -TYPE:"fm:forums" -TYPE:"fm:forum" -TYPE:"fm:topic" -TYPE:"fm:post" +(TYPE:"content" OR TYPE:"app:filelink" OR TYPE:"folder")
      	at org.springframework.extensions.webscripts.AbstractWebScript.createStatusException(AbstractWebScript.java:1129)
      	at org.springframework.extensions.webscripts.DeclarativeWebScript.execute(DeclarativeWebScript.java:171)
      	at org.alfresco.repo.web.scripts.RepositoryContainer$3.execute(RepositoryContainer.java:426)
      	at org.alfresco.repo.transaction.RetryingTransactionHelper.doInTransaction(RetryingTransactionHelper.java:454)
      	at org.alfresco.repo.web.scripts.RepositoryContainer.transactionedExecute(RepositoryContainer.java:495)
      	at org.alfresco.repo.web.scripts.RepositoryContainer.transactionedExecuteAs(RepositoryContainer.java:553)
      	at org.alfresco.repo.web.scripts.RepositoryContainer.executeScript(RepositoryContainer.java:343)
      	at org.springframework.extensions.webscripts.AbstractRuntime.executeScript(AbstractRuntime.java:378)
      	at org.springframework.extensions.webscripts.AbstractRuntime.executeScript(AbstractRuntime.java:209)
      	at org.springframework.extensions.webscripts.servlet.WebScriptServlet.service(WebScriptServlet.java:132)
      	at javax.servlet.http.HttpServlet.service(HttpServlet.java:727)
      	at org.apache.catalina.core.ApplicationFilterChain.internalDoFilter(ApplicationFilterChain.java:303)
      	at org.apache.catalina.core.ApplicationFilterChain.doFilter(ApplicationFilterChain.java:208)
      	at org.apache.tomcat.websocket.server.WsFilter.doFilter(WsFilter.java:52)
      	at org.apache.catalina.core.ApplicationFilterChain.internalDoFilter(ApplicationFilterChain.java:241)
      	at org.apache.catalina.core.ApplicationFilterChain.doFilter(ApplicationFilterChain.java:208)
      	at org.alfresco.web.app.servlet.GlobalLocalizationFilter.doFilter(GlobalLocalizationFilter.java:61)
      	at org.apache.catalina.core.ApplicationFilterChain.internalDoFilter(ApplicationFilterChain.java:241)
      	at org.apache.catalina.core.ApplicationFilterChain.doFilter(ApplicationFilterChain.java:208)
      	at org.apache.catalina.core.StandardWrapperValve.invoke(StandardWrapperValve.java:220)
      	at org.apache.catalina.core.StandardContextValve.invoke(StandardContextValve.java:122)
      	at org.apache.catalina.authenticator.AuthenticatorBase.invoke(AuthenticatorBase.java:501)
      	at org.apache.catalina.core.StandardHostValve.invoke(StandardHostValve.java:170)
      	at org.apache.catalina.valves.ErrorReportValve.invoke(ErrorReportValve.java:98)
      	at org.apache.catalina.core.StandardEngineValve.invoke(StandardEngineValve.java:116)
      	at org.apache.catalina.connector.CoyoteAdapter.service(CoyoteAdapter.java:408)
      	at org.apache.coyote.http11.AbstractHttp11Processor.process(AbstractHttp11Processor.java:1040)
      	at org.apache.coyote.AbstractProtocol$AbstractConnectionHandler.process(AbstractProtocol.java:607)
      	at org.apache.tomcat.util.net.AprEndpoint$SocketWithOptionsProcessor.run(AprEndpoint.java:2378)
      	at java.util.concurrent.ThreadPoolExecutor.runWorker(ThreadPoolExecutor.java:1145)
      	at java.util.concurrent.ThreadPoolExecutor$Worker.run(ThreadPoolExecutor.java:615)
      	at java.lang.Thread.run(Thread.java:724)
      Caused by: org.alfresco.scripts.ScriptException: 042641447 Failed to execute script 'classpath*:alfresco/templates/webscripts/org/alfresco/slingshot/documentlibrary/doclist.get.js': 042641446 Failed to execute search: +PATH:"/app:company_home/st:sites//cm:*" +@cm\:modified:[2014\-5\-19T00\:00\:00.000 TO 2014\-5\-26T23\:59\:59.999] +@cm\:modifier:"jmuser04000" +TYPE:"cm:content" -TYPE:"cm:systemfolder" -TYPE:"fm:forums" -TYPE:"fm:forum" -TYPE:"fm:topic" -TYPE:"fm:post" +(TYPE:"content" OR TYPE:"app:filelink" OR TYPE:"folder")
      	at org.alfresco.repo.jscript.RhinoScriptProcessor.execute(RhinoScriptProcessor.java:204)
      	at org.alfresco.repo.processor.ScriptServiceImpl.execute(ScriptServiceImpl.java:212)
      	at org.alfresco.repo.processor.ScriptServiceImpl.executeScript(ScriptServiceImpl.java:174)
      	at org.alfresco.repo.web.scripts.RepositoryScriptProcessor.executeScript(RepositoryScriptProcessor.java:102)
      	at org.springframework.extensions.webscripts.AbstractWebScript.executeScript(AbstractWebScript.java:1367)
      	at org.springframework.extensions.webscripts.DeclarativeWebScript.execute(DeclarativeWebScript.java:86)
      	... 30 more
      Caused by: org.alfresco.error.AlfrescoRuntimeException: 042641446 Failed to execute search: +PATH:"/app:company_home/st:sites//cm:*" +@cm\:modified:[2014\-5\-19T00\:00\:00.000 TO 2014\-5\-26T23\:59\:59.999] +@cm\:modifier:"jmuser04000" +TYPE:"cm:content" -TYPE:"cm:systemfolder" -TYPE:"fm:forums" -TYPE:"fm:forum" -TYPE:"fm:topic" -TYPE:"fm:post" +(TYPE:"content" OR TYPE:"app:filelink" OR TYPE:"folder")
      	at org.alfresco.repo.jscript.Search.queryResultMeta(Search.java:990)
      	at org.alfresco.repo.jscript.Search.queryResultSet(Search.java:749)
      	at org.alfresco.repo.jscript.Search.query(Search.java:558)
      	at sun.reflect.NativeMethodAccessorImpl.invoke0(Native Method)
      	at sun.reflect.NativeMethodAccessorImpl.invoke(NativeMethodAccessorImpl.java:57)
      	at sun.reflect.DelegatingMethodAccessorImpl.invoke(DelegatingMethodAccessorImpl.java:43)
      	at java.lang.reflect.Method.invoke(Method.java:606)
      	at org.mozilla.javascript.MemberBox.invoke(MemberBox.java:126)
      	at org.mozilla.javascript.NativeJavaMethod.call(NativeJavaMethod.java:225)
      	at org.mozilla.javascript.optimizer.OptRuntime.call1(OptRuntime.java:32)
      	at org.mozilla.javascript.gen.classpath__alfresco_templates_webscripts_org_alfresco_slingshot_documentlibrary_doclist_get_js_5._c_getDoclist_20(classpath*:alfresco/templates/webscripts/org/alfresco/slingshot/documentlibrary/doclist.get.js:1209)
      	at org.mozilla.javascript.gen.classpath__alfresco_templates_webscripts_org_alfresco_slingshot_documentlibrary_doclist_get_js_5.call(classpath*:alfresco/templates/webscripts/org/alfresco/slingshot/documentlibrary/doclist.get.js)
      	at org.mozilla.javascript.optimizer.OptRuntime.callName0(OptRuntime.java:74)
      	at org.mozilla.javascript.gen.classpath__alfresco_templates_webscripts_org_alfresco_slingshot_documentlibrary_doclist_get_js_5._c_script_0(classpath*:alfresco/templates/webscripts/org/alfresco/slingshot/documentlibrary/doclist.get.js:1430)
      	at org.mozilla.javascript.gen.classpath__alfresco_templates_webscripts_org_alfresco_slingshot_documentlibrary_doclist_get_js_5.call(classpath*:alfresco/templates/webscripts/org/alfresco/slingshot/documentlibrary/doclist.get.js)
      	at org.mozilla.javascript.ContextFactory.doTopCall(ContextFactory.java:394)
      	at org.mozilla.javascript.ScriptRuntime.doTopCall(ScriptRuntime.java:3091)
      	at org.mozilla.javascript.gen.classpath__alfresco_templates_webscripts_org_alfresco_slingshot_documentlibrary_doclist_get_js_5.call(classpath*:alfresco/templates/webscripts/org/alfresco/slingshot/documentlibrary/doclist.get.js)
      	at org.mozilla.javascript.gen.classpath__alfresco_templates_webscripts_org_alfresco_slingshot_documentlibrary_doclist_get_js_5.exec(classpath*:alfresco/templates/webscripts/org/alfresco/slingshot/documentlibrary/doclist.get.js)
      	at org.alfresco.repo.jscript.RhinoScriptProcessor.executeScriptImpl(RhinoScriptProcessor.java:502)
      	at org.alfresco.repo.jscript.RhinoScriptProcessor.execute(RhinoScriptProcessor.java:200)
      	... 35 more
      Caused by: java.lang.UnsupportedOperationException
      	at org.alfresco.repo.security.permissions.impl.acegi.FilteringResultSet.hasMore(FilteringResultSet.java:283)
      	at org.alfresco.repo.jscript.Search.queryResultMeta(Search.java:925)
      	... 55 more
      
      2014-05-26 11:40:31,785  ERROR [extensions.webscripts.AbstractRuntime] [catalina-alfresco-2] Exception from executeScript - redirecting to status template error: 04260043 Wrapped Exception (with status template): 042641530 Failed to execute script 'classpath*:alfresco/templates/webscripts/org/alfresco/slingshot/documentlibrary/images.get.js': 042641529 Failed to execute search: +PATH:"/app:company_home/st:sites/cm:jmuser04010site/cm:documentLibrary//*" +TYPE:"cm:content" +@cm\:content.mimetype:image/*
       org.springframework.extensions.webscripts.WebScriptException: 04260043 Wrapped Exception (with status template): 042641530 Failed to execute script 'classpath*:alfresco/templates/webscripts/org/alfresco/slingshot/documentlibrary/images.get.js': 042641529 Failed to execute search: +PATH:"/app:company_home/st:sites/cm:jmuser04010site/cm:documentLibrary//*" +TYPE:"cm:content" +@cm\:content.mimetype:image/*
      	at org.springframework.extensions.webscripts.AbstractWebScript.createStatusException(AbstractWebScript.java:1129)
      	at org.springframework.extensions.webscripts.DeclarativeWebScript.execute(DeclarativeWebScript.java:171)
      	at org.alfresco.repo.web.scripts.RepositoryContainer$3.execute(RepositoryContainer.java:426)
      	at org.alfresco.repo.transaction.RetryingTransactionHelper.doInTransaction(RetryingTransactionHelper.java:454)
      	at org.alfresco.repo.web.scripts.RepositoryContainer.transactionedExecute(RepositoryContainer.java:495)
      	at org.alfresco.repo.web.scripts.RepositoryContainer.transactionedExecuteAs(RepositoryContainer.java:553)
      	at org.alfresco.repo.web.scripts.RepositoryContainer.executeScript(RepositoryContainer.java:343)
      	at org.springframework.extensions.webscripts.AbstractRuntime.executeScript(AbstractRuntime.java:378)
      	at org.springframework.extensions.webscripts.AbstractRuntime.executeScript(AbstractRuntime.java:209)
      	at org.springframework.extensions.webscripts.servlet.WebScriptServlet.service(WebScriptServlet.java:132)
      	at javax.servlet.http.HttpServlet.service(HttpServlet.java:727)
      	at org.apache.catalina.core.ApplicationFilterChain.internalDoFilter(ApplicationFilterChain.java:303)
      	at org.apache.catalina.core.ApplicationFilterChain.doFilter(ApplicationFilterChain.java:208)
      	at org.apache.tomcat.websocket.server.WsFilter.doFilter(WsFilter.java:52)
      	at org.apache.catalina.core.ApplicationFilterChain.internalDoFilter(ApplicationFilterChain.java:241)
      	at org.apache.catalina.core.ApplicationFilterChain.doFilter(ApplicationFilterChain.java:208)
      	at org.alfresco.web.app.servlet.GlobalLocalizationFilter.doFilter(GlobalLocalizationFilter.java:61)
      	at org.apache.catalina.core.ApplicationFilterChain.internalDoFilter(ApplicationFilterChain.java:241)
      	at org.apache.catalina.core.ApplicationFilterChain.doFilter(ApplicationFilterChain.java:208)
      	at org.apache.catalina.core.StandardWrapperValve.invoke(StandardWrapperValve.java:220)
      	at org.apache.catalina.core.StandardContextValve.invoke(StandardContextValve.java:122)
      	at org.apache.catalina.authenticator.AuthenticatorBase.invoke(AuthenticatorBase.java:501)
      	at org.apache.catalina.core.StandardHostValve.invoke(StandardHostValve.java:170)
      	at org.apache.catalina.valves.ErrorReportValve.invoke(ErrorReportValve.java:98)
      	at org.apache.catalina.core.StandardEngineValve.invoke(StandardEngineValve.java:116)
      	at org.apache.catalina.connector.CoyoteAdapter.service(CoyoteAdapter.java:408)
      	at org.apache.coyote.http11.AbstractHttp11Processor.process(AbstractHttp11Processor.java:1040)
      	at org.apache.coyote.AbstractProtocol$AbstractConnectionHandler.process(AbstractProtocol.java:607)
      	at org.apache.tomcat.util.net.AprEndpoint$SocketProcessor.doRun(AprEndpoint.java:2441)
      	at org.apache.tomcat.util.net.AprEndpoint$SocketProcessor.run(AprEndpoint.java:2430)
      	at java.util.concurrent.ThreadPoolExecutor.runWorker(ThreadPoolExecutor.java:1145)
      	at java.util.concurrent.ThreadPoolExecutor$Worker.run(ThreadPoolExecutor.java:615)
      	at java.lang.Thread.run(Thread.java:724)
      Caused by: org.alfresco.scripts.ScriptException: 042641530 Failed to execute script 'classpath*:alfresco/templates/webscripts/org/alfresco/slingshot/documentlibrary/images.get.js': 042641529 Failed to execute search: +PATH:"/app:company_home/st:sites/cm:jmuser04010site/cm:documentLibrary//*" +TYPE:"cm:content" +@cm\:content.mimetype:image/*
      	at org.alfresco.repo.jscript.RhinoScriptProcessor.execute(RhinoScriptProcessor.java:204)
      	at org.alfresco.repo.processor.ScriptServiceImpl.execute(ScriptServiceImpl.java:212)
      	at org.alfresco.repo.processor.ScriptServiceImpl.executeScript(ScriptServiceImpl.java:174)
      	at org.alfresco.repo.web.scripts.RepositoryScriptProcessor.executeScript(RepositoryScriptProcessor.java:102)
      	at org.springframework.extensions.webscripts.AbstractWebScript.executeScript(AbstractWebScript.java:1367)
      	at org.springframework.extensions.webscripts.DeclarativeWebScript.execute(DeclarativeWebScript.java:86)
      	... 31 more
      Caused by: org.alfresco.error.AlfrescoRuntimeException: 042641529 Failed to execute search: +PATH:"/app:company_home/st:sites/cm:jmuser04010site/cm:documentLibrary//*" +TYPE:"cm:content" +@cm\:content.mimetype:image/*
      	at org.alfresco.repo.jscript.Search.queryResultMeta(Search.java:990)
      	at org.alfresco.repo.jscript.Search.queryResultSet(Search.java:749)
      	at org.alfresco.repo.jscript.Search.query(Search.java:558)
      	at sun.reflect.GeneratedMethodAccessor1080.invoke(Unknown Source)
      	at sun.reflect.DelegatingMethodAccessorImpl.invoke(DelegatingMethodAccessorImpl.java:43)
      	at java.lang.reflect.Method.invoke(Method.java:606)
      	at org.mozilla.javascript.MemberBox.invoke(MemberBox.java:126)
      	at org.mozilla.javascript.NativeJavaMethod.call(NativeJavaMethod.java:225)
      	at org.mozilla.javascript.optimizer.OptRuntime.call1(OptRuntime.java:32)
      	at org.mozilla.javascript.gen.classpath__alfresco_templates_webscripts_org_alfresco_slingshot_documentlibrary_images_get_js_26._c_main_16(classpath*:alfresco/templates/webscripts/org/alfresco/slingshot/documentlibrary/images.get.js:863)
      	at org.mozilla.javascript.gen.classpath__alfresco_templates_webscripts_org_alfresco_slingshot_documentlibrary_images_get_js_26.call(classpath*:alfresco/templates/webscripts/org/alfresco/slingshot/documentlibrary/images.get.js)
      	at org.mozilla.javascript.optimizer.OptRuntime.callName0(OptRuntime.java:74)
      	at org.mozilla.javascript.gen.classpath__alfresco_templates_webscripts_org_alfresco_slingshot_documentlibrary_images_get_js_26._c_script_0(classpath*:alfresco/templates/webscripts/org/alfresco/slingshot/documentlibrary/images.get.js:883)
      	at org.mozilla.javascript.gen.classpath__alfresco_templates_webscripts_org_alfresco_slingshot_documentlibrary_images_get_js_26.call(classpath*:alfresco/templates/webscripts/org/alfresco/slingshot/documentlibrary/images.get.js)
      	at org.mozilla.javascript.ContextFactory.doTopCall(ContextFactory.java:394)
      	at org.mozilla.javascript.ScriptRuntime.doTopCall(ScriptRuntime.java:3091)
      	at org.mozilla.javascript.gen.classpath__alfresco_templates_webscripts_org_alfresco_slingshot_documentlibrary_images_get_js_26.call(classpath*:alfresco/templates/webscripts/org/alfresco/slingshot/documentlibrary/images.get.js)
      	at org.mozilla.javascript.gen.classpath__alfresco_templates_webscripts_org_alfresco_slingshot_documentlibrary_images_get_js_26.exec(classpath*:alfresco/templates/webscripts/org/alfresco/slingshot/documentlibrary/images.get.js)
      	at org.alfresco.repo.jscript.RhinoScriptProcessor.executeScriptImpl(RhinoScriptProcessor.java:502)
      	at org.alfresco.repo.jscript.RhinoScriptProcessor.execute(RhinoScriptProcessor.java:200)
      	... 36 more
      Caused by: java.lang.UnsupportedOperationException
      	at org.alfresco.repo.security.permissions.impl.acegi.FilteringResultSet.hasMore(FilteringResultSet.java:283)
      	at org.alfresco.repo.jscript.Search.queryResultMeta(Search.java:925)
      	... 55 more
      

      Not all tests run for BM-0013. The same errors were detected in the logs for at1-at4.
      Next tests didn't run:

      share.doclib.createFolder
      share.doclib.selectFile
      share.doclib.selectFileUpload
      share.doclib.selectFolder
      share.doclib.selectNewFolder
      share.doclib.uploadFile
      share.nav.createSite
      share.site.create
      
      share.nav.documentLibrary tests completely failed.
      

      Please, find logs for BM-0010 by path below:

      ms1: /data/replicate/bm0013/logs/jmeter_430_b1717 
      

      for BM-0013 by path below:

      ms1: /data/replicate/bm0013/logs/soak_430_b1717 
      

      or see attachment.

        Attachments

          Issue Links

            Structure

              Activity

                People

                • Assignee:
                  closedissues Closed Issues
                  Reporter:
                  alfrescoqa Alfresco QA Team
                • Votes:
                  0 Vote for this issue
                  Watchers:
                  4 Start watching this issue

                  Dates

                  • Created:
                    Updated:
                    Resolved:

                    Structure Helper Panel