Uploaded image for project: 'Service Packs and Hot Fixes'
  1. Service Packs and Hot Fixes
  2. MNT-12875

Tags list in Repository view does not work when overridden repository root node using xpath syntax is used.

    Details

      Description

      Override the Document Library repository root in share config XML using an xpath value e.g.

         <config evaluator="string-compare" condition="RepositoryLibrary" replace="true">
            <root-node>/app:company_home/app:user_homes</root-node>
      ...
      

      Tags list in Repository view does not work - throws lots of errors on Alfresco log:

      2014-12-01 09:25:51,737 ERROR [org.springframework.extensions.webscripts.AbstractRuntime] [http-apr-8080-exec-10] Exception from executeScript - redirecting to status template error: 11010002 Wrapped Exception (with status template): 11010334 Failed to execute script 'classpath*:alfresco/templates/webscripts/org/alfresco/collaboration/tagQuery.get.js': 11010333 Invalid store ref: Does not contain ://   /app:company_home
      org.springframework.extensions.webscripts.WebScriptException: 11010002 Wrapped Exception (with status template): 11010334 Failed to execute script 'classpath*:alfresco/templates/webscripts/org/alfresco/collaboration/tagQuery.get.js': 11010333 Invalid store ref: Does not contain ://   /app:company_home
      	at org.springframework.extensions.webscripts.AbstractWebScript.createStatusException(AbstractWebScript.java:1126)
      	at org.springframework.extensions.webscripts.DeclarativeWebScript.execute(DeclarativeWebScript.java:171)
      	at org.alfresco.repo.web.scripts.RepositoryContainer$3.execute(RepositoryContainer.java:463)
      	at org.alfresco.repo.transaction.RetryingTransactionHelper.doInTransaction(RetryingTransactionHelper.java:454)
      	at org.alfresco.repo.web.scripts.RepositoryContainer.transactionedExecute(RepositoryContainer.java:532)
      	at org.alfresco.repo.web.scripts.RepositoryContainer.transactionedExecuteAs(RepositoryContainer.java:600)
      	at org.alfresco.repo.web.scripts.RepositoryContainer.executeScriptInternal(RepositoryContainer.java:380)
      	at org.alfresco.repo.web.scripts.RepositoryContainer.executeScript(RepositoryContainer.java:261)
      	at org.springframework.extensions.webscripts.AbstractRuntime.executeScript(AbstractRuntime.java:378)
      	at org.springframework.extensions.webscripts.AbstractRuntime.executeScript(AbstractRuntime.java:209)
      	at org.springframework.extensions.webscripts.servlet.WebScriptServlet.service(WebScriptServlet.java:132)
      	at javax.servlet.http.HttpServlet.service(HttpServlet.java:728)
      	at org.apache.catalina.core.ApplicationFilterChain.internalDoFilter(ApplicationFilterChain.java:305)
      	at org.apache.catalina.core.ApplicationFilterChain.doFilter(ApplicationFilterChain.java:210)
      	at org.alfresco.web.app.servlet.GlobalLocalizationFilter.doFilter(GlobalLocalizationFilter.java:61)
      	at org.apache.catalina.core.ApplicationFilterChain.internalDoFilter(ApplicationFilterChain.java:243)
      	at org.apache.catalina.core.ApplicationFilterChain.doFilter(ApplicationFilterChain.java:210)
      	at org.apache.catalina.core.StandardWrapperValve.invoke(StandardWrapperValve.java:222)
      	at org.apache.catalina.core.StandardContextValve.invoke(StandardContextValve.java:123)
      	at org.apache.catalina.authenticator.AuthenticatorBase.invoke(AuthenticatorBase.java:472)
      	at org.apache.catalina.core.StandardHostValve.invoke(StandardHostValve.java:171)
      	at org.apache.catalina.valves.ErrorReportValve.invoke(ErrorReportValve.java:99)
      	at org.apache.catalina.valves.AccessLogValve.invoke(AccessLogValve.java:953)
      	at org.apache.catalina.core.StandardEngineValve.invoke(StandardEngineValve.java:118)
      	at org.apache.catalina.connector.CoyoteAdapter.service(CoyoteAdapter.java:408)
      	at org.apache.coyote.http11.AbstractHttp11Processor.process(AbstractHttp11Processor.java:1008)
      	at org.apache.coyote.AbstractProtocol$AbstractConnectionHandler.process(AbstractProtocol.java:589)
      	at org.apache.tomcat.util.net.AprEndpoint$SocketProcessor.run(AprEndpoint.java:1852)
      	at java.util.concurrent.ThreadPoolExecutor.runWorker(ThreadPoolExecutor.java:1142)
      	at java.util.concurrent.ThreadPoolExecutor$Worker.run(ThreadPoolExecutor.java:617)
      	at java.lang.Thread.run(Thread.java:745)
      Caused by: org.alfresco.scripts.ScriptException: 11010334 Failed to execute script 'classpath*:alfresco/templates/webscripts/org/alfresco/collaboration/tagQuery.get.js': 11010333 Invalid store ref: Does not contain ://   /app:company_home
      	at org.alfresco.repo.jscript.RhinoScriptProcessor.execute(RhinoScriptProcessor.java:204)
      	at org.alfresco.repo.processor.ScriptServiceImpl.execute(ScriptServiceImpl.java:212)
      	at org.alfresco.repo.processor.ScriptServiceImpl.executeScript(ScriptServiceImpl.java:174)
      	at org.alfresco.repo.web.scripts.RepositoryScriptProcessor.executeScript(RepositoryScriptProcessor.java:102)
      	at org.springframework.extensions.webscripts.AbstractWebScript.executeScript(AbstractWebScript.java:1364)
      	at org.springframework.extensions.webscripts.DeclarativeWebScript.execute(DeclarativeWebScript.java:86)
      	... 29 more
      Caused by: org.alfresco.error.AlfrescoRuntimeException: 11010333 Invalid store ref: Does not contain ://   /app:company_home
      	at org.alfresco.service.cmr.repository.StoreRef.<init>(StoreRef.java:76)
      	at org.alfresco.service.cmr.repository.NodeRef.<init>(NodeRef.java:108)
      	at org.alfresco.repo.jscript.Search.findNode(Search.java:179)
      	at sun.reflect.NativeMethodAccessorImpl.invoke0(Native Method)
      	at sun.reflect.NativeMethodAccessorImpl.invoke(NativeMethodAccessorImpl.java:62)
      	at sun.reflect.DelegatingMethodAccessorImpl.invoke(DelegatingMethodAccessorImpl.java:43)
      	at java.lang.reflect.Method.invoke(Method.java:483)
      	at org.mozilla.javascript.MemberBox.invoke(MemberBox.java:126)
      	at org.mozilla.javascript.NativeJavaMethod.call(NativeJavaMethod.java:225)
      	at org.mozilla.javascript.optimizer.OptRuntime.call1(OptRuntime.java:32)
      	at org.mozilla.javascript.gen.classpath__alfresco_templates_webscripts_org_alfresco_collaboration_tagQuery_get_js_12._c_tagQuery_1(classpath*:alfresco/templates/webscripts/org/alfresco/collaboration/tagQuery.get.js:14)
      	at org.mozilla.javascript.gen.classpath__alfresco_templates_webscripts_org_alfresco_collaboration_tagQuery_get_js_12.call(classpath*:alfresco/templates/webscripts/org/alfresco/collaboration/tagQuery.get.js)
      	at org.mozilla.javascript.optimizer.OptRuntime.callName0(OptRuntime.java:74)
      	at org.mozilla.javascript.gen.classpath__alfresco_templates_webscripts_org_alfresco_collaboration_tagQuery_get_js_12._c_script_0(classpath*:alfresco/templates/webscripts/org/alfresco/collaboration/tagQuery.get.js:184)
      	at org.mozilla.javascript.gen.classpath__alfresco_templates_webscripts_org_alfresco_collaboration_tagQuery_get_js_12.call(classpath*:alfresco/templates/webscripts/org/alfresco/collaboration/tagQuery.get.js)
      	at org.mozilla.javascript.ContextFactory.doTopCall(ContextFactory.java:394)
      	at org.mozilla.javascript.ScriptRuntime.doTopCall(ScriptRuntime.java:3091)
      	at org.mozilla.javascript.gen.classpath__alfresco_templates_webscripts_org_alfresco_collaboration_tagQuery_get_js_12.call(classpath*:alfresco/templates/webscripts/org/alfresco/collaboration/tagQuery.get.js)
      	at org.mozilla.javascript.gen.classpath__alfresco_templates_webscripts_org_alfresco_collaboration_tagQuery_get_js_12.exec(classpath*:alfresco/templates/webscripts/org/alfresco/collaboration/tagQuery.get.js)
      	at org.alfresco.repo.jscript.RhinoScriptProcessor.executeScriptImpl(RhinoScriptProcessor.java:502)
      	at org.alfresco.repo.jscript.RhinoScriptProcessor.execute(RhinoScriptProcessor.java:200)
      	... 34 more
      

        Attachments

          Structure

            Activity

              People

              • Assignee:
                closedbugs Closed Bugs
                Reporter:
                kroast Kevin Roast [X] (Inactive)
              • Votes:
                0 Vote for this issue
                Watchers:
                3 Start watching this issue

                Dates

                • Created:
                  Updated:
                  Resolved:

                  Structure Helper Panel